Home > Cannot Find > Cannot Find Lz Ubuntu

Cannot Find Lz Ubuntu

Contents

Revindran Unnikrishnan 35.330 visualizaciones 4:27 Terminal Lesson 17 - Run Python scripts from the Terminal - Duración: 2:27. Once I did that, problem solved. Reverse a hexadecimal number in bash Product catalog Why there are no approximation algorithms for SAT and other decision problems? Installing lib32z1-dev solved my problem, under Ubuntu you can install it with the following command: sudo apt-get install lib32z1-dev share|improve this answer edited Nov 22 '13 at 13:47 Chilledrat 2,49031731 answered http://haywirerobotics.com/cannot-find/usr-bin-ld-cannot-find-lgl-ubuntu.html

UPDATE 2 After fixing the incorrect symbolic link, I now have [[email protected] trunk]# ls -l /lib/libz.so* lrwxrwxrwx. 1 root root 18 Feb 23 22:58 /lib/libz.so -> /usr/lib64/libz.so lrwxrwxrwx. 1 root root Thanks fuero for help linux 32bit-64bit share|improve this question edited Feb 23 '13 at 20:56 asked Feb 23 '13 at 19:10 mahmood 2954717 1 If an answer helped you resolve Makefile:56: recipe for target 'bgzf.o' failed make[2]: *** [bgzf.o] Error 1 make[2]: Leaving directory '/cygdrive/c/Users/ADMIN/Cygwin/home/samtools-0.1.19' Makefile:27: recipe for target 'lib-recur' failed make[1]: *** [lib-recur] Error 1 make[1]: Leaving directory '/cygdrive/c/Users/ADMIN/Cygwin/home/samtools-0.1.19' Makefile:27: Cargando... http://stackoverflow.com/questions/3373995/usr-bin-ld-cannot-find-lz

Cannot Find Lz Ubuntu

Se podrá valorar cuando se haya alquilado el vídeo. allthingseducational 29.664 visualizaciones 2:27 حل مشكل تشغيل ادوات Python على الوندوز مثل facebook.py - Duración: 4:56. What does make tell you after this? See here Retrieved from "http://wiki.secondlife.com/w/index.php?title=Common_compilation_problems&oldid=1196829" Categories: Open Source PortalCompiling viewer Navigation menu Views Page Discussion View source History Personal tools Log in Navigation About & Help Editing Guidelines Main Page Recent

LLKDU This is not present in the automated libs download but is required at least on windows by the copy_win_scrips script. GenoMax03-25-2014, 04:01 AMCan you post a listing of the files in the samtools directory? $ ls -l samtools* nuseqr03-25-2014, 11:40 PMThanks GenoMax, Please take a look at this. vBulletin v3.8.9, Copyright ©2000-2016, vBulletin Solutions, Inc. Lib32z1-dev What version of gcc and cygwin do you have?

OK, I am not clued up at all in UNIX so naturally, as a Samtools installation does not seem to run smoothly, I am having some trouble. Cytosine08-04-2014, 01:31 AMThere is an old post about this same problem on this forum: link (http://seqanswers.com/forums/archive/index.php/t-7391.html) There it is proposed to rename the functions in the DFLAGS line in the makefile: That was all I needed Samtools to do for me so thanks to SEQanswers for assisting me to that end. Why do languages require parenthesis around expressions when used with "if" and "while"?

Siguiente Solve the error Arduino collect2.exe error ld returned 5 exit status ld.exe- English Version - Duración: 3:04. Usr Bin Ld Cannot Find Collect2 Ld Returned 1 Exit Status How can I solve that? make[1]: Leaving directory '/opt/postgis/postgis-2.2.0dev/liblwgeom' ---- Making all in libpgcommon make[1]: Entering directory '/opt/postgis/postgis-2.2.0dev/libpgcommon' make[1]: Nothing to be done for 'all'. Cannot open include file: 'windows.h' If you run into this problem: ..\..\..\boost/regex/v4/fileiter.hpp(44): fatal error C1083: Cannot open include file: 'windows.h': No such file or directory Fix it with this: (thanks Fairlight!)

  1. Unresolved external symbol _CLSID_DxDiagProvider/_IID_IDxDiagProvider newview error LNK2001: unresolved external symbol _CLSID_DxDiagProvider newview error LNK2001: unresolved external symbol _IID_IDxDiagProvider These errors reportedly occur with MSVC 2003 and certain versions of the DirectX
  2. not any better!
  3. Añadir a Cargando listas de reproducción...
  4. Terms Privacy Security Status Help You can't perform that action at this time.
  5. In the "show directories for" dropdown, choose "Executable files".

"/usr/bin/ld: Cannot Find -lz" Centos

make[2]: Leaving directory '/cygdrive/c/Sam/samtools-0.1.19/bcftools' make[2]: Entering directory '/cygdrive/c/Sam/samtools-0.1.19/misc' make[2]: Nothing to be done for 'lib'. and added the "#" in the following line? Cannot Find Lz Ubuntu I get an error saying, /usr/bin/ld: cannot find -lz Can you please tell me how can I fix it? "usr/bin/ld: Cannot Find -lm" On ubuntu-based system you'd just do: sudo apt-get install libncurses5-dev libncursesw5-dev But Cygwin is a little different...

I did not install these. navigate here I already have the zlib1g-dev library installed: $ sudo apt-get install zlib1g-dev Reading package lists... You signed in with another tab or window. It comes with a ton of useful software preinstalled along with all their dependencies (obviously). "/usr/bin/ld: Cannot Find -ledit"

I got an error when I compiled Samtools under Cygwin 1.7 (windows vista 32 bit). I still got errors on 'make' Then I tried changing the parameters in the 'makefile' file as suggested by the first link but it still would not install with 'make' My incompatible libopenjpeg.a when searching for -lopenjpeg Building Client on Ubuntu 7.04 AMD64 /usr/bin/ld: skipping incompatible /home/dereck/Desktop/SLdev/linden/libraries/i686-linux/lib_release_client/libopenjpeg.a when searching for -lopenjpeg /usr/bin/ld: cannot find -lopenjpeg collect2: ld returned 1 exit status I http://haywirerobotics.com/cannot-find/cannot-find-lx11-ubuntu.html The VWR compile was happy after that.

Cerrar Más información View this message in English Estás viendo YouTube en Español (España). What Is Libz bgzf.h:33:18: fatal error: zlib.h: No such file or directory #include ^ compilation terminated. Inicia sesión para que tengamos en cuenta tu opinión.

Since this is windows you can find the compiled DLL here: http://zlib.net/zlib128-dll.zip.

Scorpion4308-02-2014, 11:19 PMHello, I need to use Samtools to create bam index files so that I can use IGV to look at DNA bam files. Cytosine08-03-2014, 11:52 PMUndefined reference would probably mean you unlinked a library too much. Thanks GenoMax, Please see this note given in the usage.txt file Using ZLIB1.DLL with gcc/Cygwin =============================== ZLIB1.DLL is not designed to work with Cygwin. Libz Is Required For Mesos To Build Reload to refresh your session.

Look here for updates: VWR-9541 Express editions of Visual C++ Express editions do not have some of the extra features that VSTool.exe requires, VSTool is a little application that sets a Is privacy compromised when sharing SHA-1 hashed URLs? nuseqr03-28-2014, 03:35 AMNo it was not in the Win32 folder. this contact form scons: warning: Two different environments were specified for target /tmp/paul/home/paul/builds/secondlife/src/linden/indra/x86_64-linux-client-release/llcrashlogger/llcrashlogger.o>, but they appear to have the same action: $CXX -o $TARGET -c $CXXFLAGS $_CCCOMCOM $SOURCES File "/home/paul/builds/secondlife/src/linden/indra/SConstruct", line 568, in create_executable

Why is (a % 256) different than (a & 0xFF)? The cost of switching to electric cars? You did remember to copy it over, right? Does this mean that I need to add CYGZ.DLL?

Good luck with analysis and whatnot. Richard Finney06-26-2013, 09:51 AMemma924, you need to be more specific. I saw a report, and modified the SConstruct file to drop the trailing arguments (and spaces) in LINKFLAGS. Bit by Bit Instruction 11.322 visualizaciones 3:36 How to Install Python Modules - Duración: 2:47.

more stack exchange communities company blog Stack Exchange Inbox Reputation and Badges sign up log in tour help Tour Start here for a quick overview of the site Help Center Detailed To find out whether it's installed, try this: yum list installed | grep zlib This is from a RHEL 6.3 reference system: # rpm -ql zlib-devel /usr/include/zconf.h /usr/include/zlib.h /usr/lib64/libz.so <---- the