Home > Cannot Find > Cannot Find Symbol List Java

Cannot Find Symbol List Java


Today's Topics Dream.In.Code > Programming Help > Java Arraylist error: cannot find symbol variable Page 1 of 1 New Topic/Question Reply 3 Replies - 5667 Views - Last Post: 25 September Luggage l3= new Luggage(49000); Luggage l4= new Luggage(2000); f.addLuggage(l1); //stocking Luggages in array f.addLuggage(l2); f.addLuggage(l3); f.availableLoadCapacity(); //checking space is left f.addLuggage(l4); // trying to add last piece of luggage System.out.println(f.toString()); //print Acceso rápido. In Luggage, you have a void method called Luggage(). http://haywirerobotics.com/cannot-find/java-cannot-find-symbol-class.html

En la parte final de la página pulsa el botón "cambiar perfil". Not the answer you're looking for? Error:Execution failed for task ':app:compileDebugJava'. > Compilation failed; see the compiler error output for details. So without knowing what exactly you did in BlueJ, I can't help with that.

Cannot Find Symbol List Java

browsing This topic has been deleted. Para iniciar sesión pulsa aquí. Again I don't imagine that's what you want. Powered by SMF Simple Machines LLC © 2006–2011Página principal aprenderaprogramar.com - RSS Foros - WAP2 teléfonos móviles

I've also tried to use single characters - another error will then be: "Incompatible types". The error occured due to the fact that the array had no actual object to put in the Arraylist. If you need to get the suit from a card at position i in the List, your Hand class should have methods like getCardAt(int i) and getSuitFromCardAt(int i). Cannot Find Symbol Class If "hand" were declared out there next to "cashtotal" and "playerName", you would find that your code would work just fine.

the argument). Cannot Find Symbol Variable Arraylist You're creating a new local variable named luggages of type ArrayList and then never use it. current community chat Stack Overflow Meta Stack Overflow your communities Sign up or log in to customize your list. https://coderanch.com/t/412418/java/java/Compiler-find-symbol-ArrayList Basicaly I'd love to know if my Player class can hold an ArrayList for each player as I want it to, and also how I can initialize it.

Glassmapper fields displaying null despite correct item ID Are there continuous functions for which the epsilon-delta property doesn't hold? Java Import List Sign up Sign in Can't sign in? share|improve this answer answered Feb 11 '11 at 1:23 Scott M. 5,8531835 add a comment| up vote 9 down vote You need to add import declarations on class file header. En línea Imprimir Páginas: [1] « anterior próximo » Foros aprenderaprogramar.com - Didáctica y divulgación de la programación » Aprender a programar » Aprender a programar desde cero » Ejercicio CU00667B

  1. In it, you'll get: The week's top questions and answers Important community announcements Questions that need answers see an example newsletter By subscribing, you agree to the privacy policy and terms
  2. Why is (a % 256) different than (a & 0xFF)?
  3. Join them; it only takes a minute: Sign up java - cannot find symbol - Class Arraylist up vote 2 down vote favorite 2 I keep getting the following error with

Cannot Find Symbol Variable Arraylist

Can anyone tell me why? http://ideone.com/0L5HdK BUILD FAILED Total time: 9 mins 40.625 secs Please, can anyone help me, what can I do? Cannot Find Symbol List Java GO OUT AND VOTE Default value for date field Move to directory that was no directory Is adding the ‘tbl’ prefix to table names really a problem? Java Error Cannot Find Symbol List more stack exchange communities company blog Stack Exchange Inbox Reputation and Badges sign up log in tour help Tour Start here for a quick overview of the site Help Center Detailed

I hope to have been helpfull. http://haywirerobotics.com/cannot-find/cannot-find-symbol-java-compile-error.html Why there are no approximation algorithms for SAT and other decision problems? posted 8 years ago Hi Joe, Welcome to JavaRanch! IN operator must be used with an iterable expression GO OUT AND VOTE What crime would be illegal to uncover in medieval Europe? Type List Does Not Take Parameters

Thanks for your help! How can I take a powerful plot item away from players without frustrating them? Encapsulation seems to make inheritance counter productive in this example? weblink Title Comments Hello, I try to run my project in android studio ans get this error: Information:Gradle tasks [:app:assembleDebug] :app:preBuild UP-TO-DATE :app:preDebugBuild UP-TO-DATE :app:compileDebugNdk UP-TO-DATE :app:checkDebugManifest :app:preReleaseBuild UP-TO-DATE :app:prepareComAndroidSupportSupportV42100Library UP-TO-DATE

So every time you call addLuggage an "empty" luggage object will be added to the flight no matter what the argument was. Error Cannot Find Symbol In Java I am using BlueJ, if that's of any relevance. Note: Recompile with -Xlint:deprecation for details.

A code to test it could look something like this: public class Driver { static void exam() { //For testing stuff Flight f= new Flight("Airforce1","Washington D.C.","Area 51", 500000); Luggage l1= new

Why does the Minus World exist? Preguntas y respuestas ¿Cómo establecer o cambiar la imagen asociada (avatar) de usuario? I can't imagine that's what you intended to, so that's probably a mistake. Arraylist Length How would I specify the index of the Card object?

Cannot find symbol message All times are in JavaRanch time: GMT-6 in summer, GMT-7 in winter Contact Us | advertise | mobile view | Powered by JForum | Copyright © 1998-2016 This is either a method poorly named with a constructor name, or it is a constructor with a return type, or . . . So I'll work on that. check over here Note: Recompile with -Xlint:unchecked for details. 18 errors FAILED FAILURE: Build failed with an exception. * What went wrong: Execution failed for task ':app:compileDebugJava'. > Compilation failed; see the compiler error

more stack exchange communities company blog Stack Exchange Inbox Reputation and Badges sign up log in tour help Tour Start here for a quick overview of the site Help Center Detailed Lines 34-38: public void addLuggage(Luggage l) { l= new Luggage(); luggages.add(l); } Here you're immediately setting l to a new Luggage object and thus ignoring the original value of l (i.e. How to delete the lines from a file that do not contain dot? Note: Recompile with -Xlint:deprecation for details.

En línea Responsable de departamento de producción aprenderaprogramar.com el_calderas Sin experiencia Mensajes: 43 Re:Ejercicio CU00667B curso Java: cannot find symbol- class ArrayList « Respuesta #2 : 05 de Marzo 2015, 16:25 Is the result of the general election final on 8th of Nov, 2016? In BlueJ one would have to add a Luggage-object, and write the same name of that object, when we want to store it in the array. java arraylist share|improve this question edited Apr 3 '13 at 13:59 OptimizedQuery 1,164719 asked Apr 3 '13 at 13:55 csstudent 28114 import java.util.*; –Miguel Prz Apr 3 '13 at

Also I'm just wondering if you'd know how I would ask the System to print out some of the values in the adam.hand ArrayList's new Card object (The one that should Can I use that to take out what he owes me? Rethink what you meant to do here and fix it. Cheers for your reply and to Ernest.

new code samples recent codes sign in New user? However what I can do, is point out some mistakes in your code (they're not responsible for the errors you're seeing right now, but they will bite you eventually, so I Book Review: Murach's Java Servlets and JSP Phobos - A JavaFX Games Engine: Part 2 - JavaFX Scene API and the FSM Maven Tutorial 2 - Adding Dependencies Maven Tutorial 1 I tried server solutions, first time I use add hash set based on my AC permutations solution, I got this Compile Error.

Information:BUILD FAILED Information:Total time: 9 mins 40.625 secs Information:19 errors Information:0 warnings Information:See complete output in console Executing tasks: [:app:assembleDebug] Configuration on demand is an incubating feature. :app:preBuild UP-TO-DATE :app:preDebugBuild UP-TO-DATE