Home > Cannot Find > Checking For Ssl Libraries... Configure: Error: Cannot Find Ssl Libraries

Checking For Ssl Libraries... Configure: Error: Cannot Find Ssl Libraries

Contents

which showed a libssl.so inside of /usr/lib/x86_64-linux-gnu/ I made a link to it with: Code: ln -s /usr/lib/x86_64-linux-gnu/libssl.so /usr/lib/libssl.so ..and then was able to configure and make my nrpe install! I was able to install nrpe using this on oneric. Converting the weight of a potato into a letter grade Two-headed version of \Rightarrow or \implies Does f:x mean the same thing as f(x)? configure: error: Ezio Melotti added the comment: Can you provide more information about your operating system/platform? http://haywirerobotics.com/cannot-find/ubuntu-install-x11-libraries.html

Thanks in advance. The cost of switching to electric cars? Search Popular Recent Error : Connection Refused By Host in Nagios
How to use tmpwatch Command in Linux
Linux Interview Questions and Answers for L2 - II
bc Command Not Found in CentOS / checking for type of socket size... https://sourceforge.net/p/dar/mailman/message/6153151/

Checking For Ssl Libraries... Configure: Error: Cannot Find Ssl Libraries

Please notify the sender immediately and destroy all copies of this message and any attachments. Register Lostyourlogin? Reason: found a solution! Need to support web services, security?

  • Done Building dependency tree Reading state information...
  • In fact, libmysqlcppconn-dev (from what you listed) is the only one I didn't already have installed from your list.
  • configure:15370: $? = 1 configure: failed program was: | /* confdefs.h */ | #define PACKAGE_NAME "libssh2" | #define PACKAGE_TARNAME "libssh2" | #define PACKAGE_VERSION "-" | #define PACKAGE_STRING "libssh2 -" | #define

How to grep two numbers from the same line at different places using bash? There is NO warranty; not even for MERCHANTABILITY or FITNESS FOR A PARTICULAR PURPOSE. This is on Debian etch Thanks for any advice, Gary -- [email protected] Nrpe Install On Wed, 2007-02-07 at 08:07 -0800, Gary Taylor wrote: > I'm trying to install dar 2.3.2 from source and am getting > an error during configure about size_t.

You seem to have CSS turned off. ChrisPearce commented Sep 19, 2015 Thanks for the advice of looking in the config.log file. so i followed up on where you had left (i benefited from your solution of step 1 [location of lib files]). –tony gil Oct 12 '12 at 18:34 add a comment| http://stackoverflow.com/questions/10849548/setting-up-mysql-in-linux Is it a package I need to install?

All Rights Reserved. Cannot Find Ssl Headers Ubuntu configure: error: Cannot find ssl libraries I have installed libssl-dev and openssl package as i found them as a solution for this error. Re: [Dar-support] configure: error: Cannot find size_t type From: Gary Taylor - 2007-02-07 22:43:57 Thanks Thomas Jacob for the info. General Options: ------------------------- NRPE port: 5666 NRPE user: nagios NRPE group: nagios Nagios user: nagios Nagios group: nagios Review the options above for accuracy.

Cannot Create Regular File ‘/etc/xinetd.d/nrpe’: No Such File Or Directory

The error is : checking for size_t... (cached) no configure: error: Cannot find size_t type Even with checking in the archives and on the www I can't figure out why I'm http://bugs.python.org/issue17344 configure: error: Didn't find mysqlclient library in '/usr/lib64 /usr/lib /usr/lib64/mysql /usr/lib/mysql /usr/local/lib64 /usr/local/lib /usr/local/lib/mysql /usr/local/mysql/lib /usr/local/mysql/lib/mysql /usr/mysql/lib/mysql /opt/mysql/lib /opt/mysql/lib/mysql /sw/lib /sw/lib/mysql' I see where I can use this command to specify Checking For Ssl Libraries... Configure: Error: Cannot Find Ssl Libraries Why did Borden do that to his wife in The Prestige? Usr Local Nagios Libexec Check_nrpe No Such File Or Directory aral commented Oct 12, 2015 In case you need a third confirmation, exact same experience (error with latest Xcode 7 command line tools installed), worked via @bmathews’s instructions (thanks!) :) samkelleher

Twitter Facebook Digg Vimeo YouTube Skype

OSDir.com sysutils.backup.dar.support Subject: Re: configure: error: Cannot find size_t type Date Index Thread: Prev Next Thread Index I've just ran ./configure on http://haywirerobotics.com/cannot-find/windows-cannot-find-bat-error.html Good that you can compile nodegit now! Is it a > package I need to install? > > It works on a Ubuntu machine I have. SSL headers found in /usr checking for SSL libraries... Usr Bin Install Cannot Stat Check_nrpe No Such File Or Directory

I'm a bit surprised that it does not. Join them; it only takes a minute: Sign up Here's how it works: Anybody can ask a question Anybody can answer The best answers are voted up and rise to the If we cannot confirm that there is a problem on a currently maintained version of Python I'm afraid I'll have to close this issue. have a peek here Messages (10) msg183417 - (view) Author: shilpi (shilpi) Date: 2013-03-04 06:32 Hi we are facing "checking size of size_t error" in building python2.6 checking size of size_t...

Count trailing truths Mimsy were the Borogoves - why is "mimsy" an adjective? Check_nrpe Could Not Complete Ssl Handshake Adv Reply Quick Navigation Installation & Upgrades Top Site Areas Settings Private Messages Subscriptions Who's Online Search Forums Forums Home Forums The Ubuntu Forum Community Ubuntu Official Flavours Support New Why is looping over find's output bad practice?

ChrisPearce closed this Sep 19, 2015 saper commented Sep 19, 2015 Most probably your OpenSSL version was too old.

more stack exchange communities company blog Stack Exchange Inbox Reputation and Badges sign up log in tour help Tour Start here for a quick overview of the site Help Center Detailed Reverse a hexadecimal number in bash Total distance traveled when visiting all rational numbers Why is (a % 256) different than (a & 0xFF)? I > have the log file added for more details. > > I did not find any workaround to solve it. Make * * * No Rule To Make Target Install Daemon Config Stop How to decline a postdoc interview if there is some possible future collaboration?

The packages that installed to have a working built environment were "binutils-doc manpages-dev autoconf automake1.9 libtool flex bison gdb gcc-doc gcc-4.1-doc gcc-4.1-locales libc6-dev-amd64 g++", probably you need to adjust this to Python 2.6 only receives security fixes, so even if it's a bug it can't be fixed there (it could be fixed on 2.7 though). ---------- _______________________________________ Python tracker _______________________________________ more hot questions question feed lang-sql about us tour help blog chat data legal privacy policy work here advertising info mobile contact us feedback Technology Life / Arts Culture / Recreation Check This Out Data Available Data Types Forecast Model Output Satellite Data Radar Data Lightning Data Wind Profiler Data Aircraft-Borne (ACARS) GPS Meteo.

Done libssl-dev is already the newest version. 0 upgraded, 0 newly installed, 0 to remove and 0 not upgraded. Download IBM WebSphere Application Server v.1.0.1 based on Apache Geronimo http://sel.as-us.falkag.net/sel?cmd=lnk&kid=120709&bid=263057&dat=121642_______________________________________________ Dar-support mailing list [email protected] https://lists.sourceforge.net/lists/listinfo/dar-support Thread at a glance: Previous Message by Date: configure: error: Cannot find size_t type I'm saper commented Nov 3, 2015 Is there a config.log file you can post? Adv Reply October 4th, 2012 #5 majordom View Profile View Forum Posts Private Message First Cup of Ubuntu Join Date Oct 2012 Beans 1 Re: nagios- nrpe installation error(configure: error:

share|improve this answer answered Jun 1 '12 at 11:42 Thor 3,81094783 libmysqlclient16 -> This is the one you should install –Jeffrey Vandenborne Jun 1 '12 at 11:47 COLLECT_GCC=gcc COLLECT_LTO_WRAPPER=/usr/lib/gcc/x86_64-linux-gnu/4.9/lto-wrapper Target: x86_64-linux-gnu Configured with: ../src/configure -v --with-pkgversion='Debian 4.9.2-10' --with-bugurl=file:///usr/share/doc/gcc-4.9/README.Bugs --enable-languages=c,c++,java,go,d,fortran,objc,obj-c++ --prefix=/usr --program-suffix=-4.9 --enable-shared --enable-linker-build-id --libexecdir=/usr/lib --without-included-gettext --enable-threads=posix --with-gxx-include-dir=/usr/include/c++/4.9 --libdir=/usr/lib --enable-nls --with-sysroot=/ --enable-clocale=gnu --enable-libstdcxx-debug --enable-libstdcxx-time=yes --enable-gnu-unique-object --disable-vtable-verify --enable-plugin --with-system-zlib --disable-browser-plugin configure:4957: $? = 4 configure:4946: gcc -qversion >&5 gcc: error: unrecognized command line option '-qversion' gcc: fatal error: no input files compilation terminated. SDF Public Access UNIX System - http://sdf.lonestar.org Re: [Dar-support] configure: error: Cannot find size_t type From: Thomas Jacob - 2007-02-07 16:44:31 Attachments: Message as HTML I've just ran ./configure on

ssl network-monitoring nagios3 share|improve this question edited May 7 '12 at 12:46 asked May 7 '12 at 12:33 ankurtr 4223616 add a comment| 4 Answers 4 active oldest votes up vote All Rights Reserved. configure:15370: $? = 1 configure: failed program was: | /* confdefs.h */ | #define PACKAGE_NAME "libssh2" | #define PACKAGE_TARNAME "libssh2" | #define PACKAGE_VERSION "-" | #define PACKAGE_STRING "libssh2 -" | #define