Home > Cannot Run > Java.io.ioexception Cannot Run Program Sh Createprocess Error=2

Java.io.ioexception Cannot Run Program Sh Createprocess Error=2

Contents

Why did Michael Corleone not forgive his brother Fredo? Into jenkins script, do the following to confirm that you do have the file cd C:\Windows\TEMP\ ls -rtl sh -xe hudson6299483223982766034.sh share|improve this answer edited May 21 '15 at 13:32 answered more stack exchange communities company blog Stack Exchange Inbox Reputation and Badges sign up log in tour help Tour Start here for a quick overview of the site Help Center Detailed shell jenkins build command ioexception share|improve this question edited 5 hours ago R O M A N I A 13.3k117083 asked May 21 '15 at 13:21 Med braim 33119 http://haywirerobotics.com/cannot-run/cannot-run-program-git-createprocess-error-2.html

The shell script (in the project build steps) looks like: #!/bin/bash rsync $WORKSPACE/trunk/ /cygdrive/s/projects/mitydsp/MDK_bleeding_edge The execution looks like: [MityDSP MDK] $ /bin/bash C:\Windows\hudson494753587924396197.sh The system cannot find the file specified FATAL: more hot questions question feed lang-sh about us tour help blog chat data legal privacy policy work here advertising info mobile contact us feedback Technology Life / Arts Culture / Recreation Configuration error? [DEBUG] Skipping watched dependency update for build: Test1 Unit TEst #5 due to result: FAILURE Finished: FAILURE My Configuration looks like this: Buildverfahren Build a Visual Studio project or Executing the tf command by configuring a job as a Windows batch command on the slave works successfully. 2. http://stackoverflow.com/questions/15135771/hudson-on-windows-error-java-io-ioexception-cannot-run-program-sh

Java.io.ioexception Cannot Run Program Sh Createprocess Error=2

more stack exchange communities company blog Stack Exchange Inbox Reputation and Badges sign up log in tour help Tour Start here for a quick overview of the site Help Center Detailed In the console output I have this: Building in workspace C:\Program Files (x86)\Jenkins\workspace\test [test] $ sh -xe C:\Windows\TEMP\hudson6299483223982766034.sh The system cannot find the file specified FATAL: L'exécution de la commande a Free forum by Nabble Edit this page

  1. Period.
  2. Hi, I am running hudson 1.346 on a linux machine.  I have a windows slave machine setup running cygwin+sshd to support running builds requirement windows applications.
  3. I just started my first real job, and have been asked to organize the office party.
  4. Your problem is that nohup does not exist at all—because you are running on Windows, so there is no reason for it to exist.
  5. It's not clear why, but the path lost C:\Program Files (x86)\Git\bin and the version of Git I was using comes with sh.exe.
  6. On 22.02.2010, at 0:20, Mike Williamson wrote: > Hudson is ssh'ing to my "normal user account" with the command: > > ssh -v [email protected] java -jar "c:\\\hudson\\\slave.jar" > > The ssh
  7. In Manage Jenkins -> Configure System -> Shell, set the shell path as C:\Windows\system32\cmd.exe share|improve this answer answered Jul 14 at 1:29 Kashan 328311 Thanks for the hint, but
  8. Like this: C:\Windows\sh myfile.sh –mainframer May 21 '15 at 13:54 to be clear i'm trying to use curl command ,i can't do this with windows command and i'm not

This seems to me to be that the executable name is still hard coded. Sorry I can't help more. –Nate Jun 2 '15 at 14:41 add a comment| up vote 1 down vote The way to fix the problem was to put the value of Automated exception search integrated into your IDE Test Samebug Integration for IntelliJ IDEA Root Cause Analysis java.io.IOException Cannot run program "sh" (in directory "C:\Program Files\Jenkins\jobs\P1\workspace"): CreateProcess error=2, The system cannot find Cannot Run Program Sh Eclipse Had to specify the shell to C\windows\system32\cmd.exe –Markus_DE_HH Feb 28 '13 at 13:41 1 Please answer your own question, so it can help others in the future, and so people

It's my own preference but I thought this might also be helpful. Cannot Run Program "bash": Createprocess Error=2, The System Cannot Find The File Specified This seems particularly likely for a multi-configuration project, but is applicable to freestyle builds as well. The issue was that the system path got shorter unexpectedly. Developer does not see priority in git Development Workflow being followed Count trailing truths Does f:x mean the same thing as f(x)?

Or you can fix it in Jenkins global config: Manage Jenkins -> Configure System -> Shell -> Shell executable = C:\Program Files (x86)\Git\bin\sh.exe share|improve this answer edited Jul 18 '14 at Jenkins The System Cannot Find The File Specified Show Oleg Nenashev added a comment - 2013/Dec/12 9:41 AM "Run command" installation step invokes "sh" by default. schleprock « Return to Jenkins users | 1 view|%1 views Loading... Atlassian DashboardsProjectsIssuesCaptureGetting started Help JIRA Core help Keyboard Shortcuts About JIRA JIRA Credits Log In Register for Jenkins World Join the Jenkins community at "Jenkins World" in Santa Clara, California from

Cannot Run Program "bash": Createprocess Error=2, The System Cannot Find The File Specified

Hide Permalink James Hancox added a comment - 2013/Dec/12 10:25 AM Aha, that does seem to solve it! https://issues.jenkins-ci.org/browse/JENKINS-22251 Why won't curl download this link when a browser will? Java.io.ioexception Cannot Run Program Sh Createprocess Error=2 Atlassian DashboardsProjectsIssuesCaptureGetting started Help JIRA Core help Keyboard Shortcuts About JIRA JIRA Credits Log In Register for Jenkins World Join the Jenkins community at "Jenkins World" in Santa Clara, California from Java.io.ioexception Cannot Run Program Cmd Jenkins Similar Issues: Show Description When executing the TFS Plugin from a Linux master to a Windows 7 slave I am getting the following error: 17:00:52 [EnvInject] - Loading node environment variables.

I just started my first real job, and have been asked to organize the office party. this contact form Show Kohsuke Kawaguchi added a comment - 2009/Jul/09 1:35 PM I'm not sure how the error message can be improved any further, but if someone has a proposal, please open a I'll restructure this issue and assign it to the core Hide Permalink Oleg Nenashev added a comment - 2014/Jan/02 9:41 PM Just FYI, https://github.com/jenkinsci/jenkins/pull/1078 should prevent such confusions Show Oleg Nenashev i use this quite a bit to get rid of the -xe parameter passed to bash. Jenkins Shell Script Windows

Assuming you are encountering this from within a workflow running the sh step, the fix is simply to use the bat step instead. Rookie mistake Feel free to close this issue. Should I allow my child to make an alternate meal if they do not like anything served at mealtime? have a peek here Hide Permalink Kohsuke Kawaguchi added a comment - 2009/Jul/09 1:35 PM I'm not sure how the error message can be improved any further, but if someone has a proposal, please open

C:\Program Files\Git\bin is in the global search path, such that Jenkins finds sh.exe Jenkins also needs nohup.exe (as the error message suggests, see also BourneshellScript.java). Java Io Ioexception Cannot Run Program Cmd Error 2 No Such File Or Directory but Jenkins is not able to find your shell command. Not the answer you're looking for?

Hence, the hunch is that an issue with the plugin. 1.

Why does the Minus World exist? share|improve this answer answered Aug 28 '13 at 9:53 funkybro 6,04712129 3 Why is this not the accepted answer? –quantum Nov 6 '15 at 16:48 add a comment| up vote IN operator must be used with an iterable expression Inequality caused by float inaccuracy Need to change cash to cashier's check without bank account (Just arrived to the US) Why do Java.io.ioexception: Cannot Run Program "/bin/sh" Rotate marker symbols individually in QGIS How to delete the lines from a file that do not contain dot?

People Assignee: Renu Chudamani Reporter: Renu Chudamani Votes: 0 Vote for this issue Watchers: 4 Start watching this issue Dates Created: 2014/Mar/18 6:21 PM Updated: 2016/Jan/28 3:39 AM Resolved: 2016/Jan/27 6:04 Correct? I just symlinked that (along with the shared libraries it needs) into /bin by running from a Windows cmd shell: mklink "C:\Program Files\Git\bin\nohup.exe" "C:\Program Files\git\usr\bin\nohup.exe" mklink "C:\Program Files\Git\bin\msys-2.0.dll" "C:\Program Files\git\usr\bin\msys-2.0.dll" mklink Check This Out asked 1 year ago viewed 18149 times active today Upcoming Events 2016 Community Moderator Election ends Nov 22 Linked 1 Set up Protractor tests with Jenkins Related 2359Calling an external command

I am trying to set up a bash shell script to run an rsync command at the end of the build process.  But it's not working. Drawing a torso with a head (using \draw) Why is looping over find's output bad practice? However, my installation of Mercurial in not in a /bin directory and I'm getting the following error: java.io.IOException: Cannot run program "hg": CreateProcess error=2, The system cannot find the file specified What movie is this?