Home > Configure Error > Configure Error C Compiler Cannot Create Executables Ubuntu 10.04

Configure Error C Compiler Cannot Create Executables Ubuntu 10.04

Error happened in '/home/crawford/crosstool-ng/trunk//lib/[email protected]_f5ab0a80e466/scripts/functions' in function 'CT_DoExecLog' (line unknown, sorry) [ERROR]????????? How to react? My bet is that the error is along the lines of "Cannot find cc1". thanks for the fix –Mike O Jul 12 '15 at 20:18 add a comment| up vote 1 down vote I was having this exact same problem trying to install tivodecode on http://haywirerobotics.com/configure-error/configure-error-c-compiler-cannot-create-executables-ubuntu-11-10.html

Look at '/home/crawford/x-tools/powerpc-860-linux-uclibc/build.log' for more info on this error. [ERROR]? (elapsed: 31:24.46) Doug ----- Original Message ---- From: Arnaud Lacombe To: Doug Crawford Cc: [email protected] Sent: Thu, September 9, share|improve this answer edited Sep 27 at 6:47 Tshilidzi 1,792719 answered Sep 27 at 1:08 user599717 11 add a comment| Your Answer draft saved draft discarded Sign up or log Could someone please help. eholz1 Adv Reply September 23rd, 2010 #7 spjackson View Profile View Forum Posts Private Message Cake for coffee's sake Join Date Aug 2010 Location Lancs, United Kingdom Beans 1,286 DistroUbuntu http://stackoverflow.com/questions/10620877/c-compiler-cannot-create-executables-ubuntu-10-04-lts

Try this command: Code: sudo apt-get install git Adv Reply April 16th, 2011 #6 myhieu View Profile View Forum Posts Private Message 5 Cups of Ubuntu Join Date May 2010 Ubuntu Logo, Ubuntu and Canonical © Canonical Ltd. this is a pentium III processor, 600 mb memory thanks, eric Adv Reply September 22nd, 2010 #2 lloyd_b View Profile View Forum Posts Private Message Tall Cafè Ubuntu Join Date

once you back everything up, buy a new harddrive and do a fresh install (and perhaps upgrade to 10.04 while you're at it). mkdir -p -- powerpc-860-linux-uclibc/libgomp [ALL? ]??? make[1]: *** [all] Error 2 [ALL? ]??? How safe is 48V DC?

share|improve this answer answered May 16 '12 at 16:03 Mat 136k21235275 +1: Well spotted; I should have seen it too. If that is the case, it means you have the current directory (".") in your path. Not the answer you're looking for? The CFLAGS answers appear to be correct.] share|improve this answer edited Jul 13 '15 at 17:44 answered Jul 12 '15 at 17:19 Colin Watson 4,47511021 libc6-dev is already the

Why do languages require parenthesis around expressions when used with "if" and "while"? I solved it slightly differently by adding a few symlinks for important files to my /usr/lib and /usr/include/gnu directories. If you are using a vanilla GCC tarball to build, it may help if you put the following in your .bashrc LIBRARY_PATH=/usr/lib/i386-linux-gnu CPATH=/usr/include/i386-linux-gnu export LIBRARY_PATH CPATH Regards Iain Sep 26 2011 Tango Icons © Tango Desktop Project.

gawk checking whether make sets $(MAKE)... https://ubuntuforums.org/showthread.php?t=1730350 Join them; it only takes a minute: Sign up Here's how it works: Anybody can ask a question Anybody can answer The best answers are voted up and rise to the Are there continuous functions for which the epsilon-delta property doesn't hold? Page 1 of 2 12 Last Jump to page: Results 1 to 10 of 20 Thread: C compiler cannot create executable Thread Tools Show Printable Version Subscribe to this Thread… Display

If that is the case, it means you have the current directory (".") in your path. http://haywirerobotics.com/configure-error/configure-error-c-compiler-cannot-create-executables-aix-5-3.html My bet is that the error is along the lines of "Cannot find cc1". Iain Buclaw (11/29) Sep 26 2011 For Debian/Ubuntu, you also need to consider that they've been experimen... Ubuntu Ubuntu Insights Planet Ubuntu Activity Page Please read before SSO login Advanced Search Forum The Ubuntu Forum Community Ubuntu Specialised Support Development & Programming Programming Talk C compiler cannot compile

Ask Ubuntu works best with JavaScript enabled FAQ Forum Quick Links Unanswered Posts New Posts View Forum Leaders FAQ Contact an Admin Forum Community Forum Council FC Agenda Forum Governance Forum My recommendation is to make sure the latest C headers are installed and then run your ./configure command. snip ... have a peek here How do I handle this?

yes [ALL? ]??? checking for powerpc-860-linux-uclibc-strip... /home/crawford/x-tools/powerpc-860-linux-uclibc/powerpc-860-linux-uclibc/bin/strip [ALL? ]??? I tried the ImageMagick program as well, and the configure ran for a while, but make fails everytime.

I do not know anything about git, but maybe this link could help you: https://help.ubuntu.com/community/Git Best regards, Luis Adv Reply April 16th, 2011 #4 myhieu View Profile View Forum Posts

Operator ASCII art What's the point of get_post_meta's $single param? You may need to disable or reconfigure prelink in /etc/systemctl or wherever your distros sets this up. That basically means that the default set of options that configure is using is causing GCC to get an error. I tried the: ./configure DFLAGS="-O3" command but with no effect.

no configure: error: in `/home/mike/cpuminer-2.4.2': configure: error: C compiler cannot create executables my system is ubuntu 14.04 and the system details say the os is 32 bit. Have you searched for the error in config.log? share|improve this answer edited Sep 19 '13 at 12:55 answered Sep 19 '13 at 12:35 steeldriver 32.4k44477 9 Normally /usr/local/bin is ahead of /usr/bin in PATH for good reason: there's Check This Out no configure: error: in `/home/nishant/.rvm/src/ruby-2.0.0-p247': configure: error: C compiler cannot create executables See `config.log' for more details I then tried a "hello world" C program and got the following error on

Is adding the ‘tbl’ prefix to table names really a problem? I just started my first real job, and have been asked to organize the office party. binutils?????? : binutils-2.20.1 > ??? Browse other questions tagged 12.04 12.10 bash gcc or ask your own question.

Once finished, I rebooted. i686-pc-linux-gnu checking for a BSD-compatible install... /usr/bin/install -c checking whether build environment is sane... For details and our forum data attribution, retention and privacy policy, see here FAQ Forum Quick Links Unanswered Posts New Posts View Forum Leaders FAQ Contact an Admin Forum Community Forum Ask Ubuntu works best with JavaScript enabled UbuntuCommunityAsk!DeveloperDesignDiscourseHardwareInsightsJujuShopMore ›AppsHelpForumLaunchpadMAASCanonical current community chat Ask Ubuntu Ask Ubuntu Meta your communities Sign up or log in to customize your list.

One other thing - I used to be able to update or get packages using apt-get. Is it anti-pattern if a class property creates and returns a new instance of a class? Then reboot. Can I cite email communication in my thesis/paper?

What worked for me was this. $ sudo aptitude update
$ sudo aptitude install libc6-dev g++ gcc Nice and simple, that fixed my problem. collect2: ld returned 1 exit status configure:4461: $? = 1 configure:4499: result: no configure: failed program was: | /* confdefs.h */ | #define PACKAGE_NAME "ImageMagick" | #define PACKAGE_TARNAME "ImageMagick" | #define I tried the hello.c program as well, and the first attempt it crashes (same error). Thanks.

User contributions on this site are licensed under the Creative Commons Attribution Share Alike 4.0 International License. Reply Leave a Reply Cancel reply Enter your comment here... collect2: ld returned 1 exit status configure:2971: $? = 1 configure:3008: result: configure: failed program was: | /* confdefs.h */ | #define PACKAGE_NAME "" | #define PACKAGE_TARNAME "" | #define PACKAGE_VERSION Thanks 12.04 12.10 bash gcc share|improve this question edited Nov 13 '13 at 7:04 asked Sep 19 '13 at 12:16 naka 2192511 I got this error when I mistakenly

Dishwasher Hose Clamps won't open How to delete the lines from a file that do not contain dot? Why won't curl download this link when a browser will?